{"text_format":"1","workbook":"xlsx","n_sheets":4,"sheets":["LISTAS","INSTRUCTIVO","1. Materialidad AC","2. Conceptos AC"],"not_rendered":{"charts":0,"images":21,"macros":0,"external_links":14,"defined_names":158,"comments":2,"pivot_tables":0},"unopened":[],"bounds":{"document_bytes":16777216,"sheet_cells":100000,"rows_first":2000,"rows_last":500,"rows_between":2000,"halvings":0,"cell_chars":16384,"cell_head_chars":4096},"cells_cut":0,"cells_raw":0,"read":"whole","date_system":"1900"}

{"sheet":"LISTAS","index":0,"n_rows":103,"n_cols":34,"rows_kept":103,"cut":false,"hidden":true,"merged":[[1,12,1,13],[6,12,6,13],[1,11,2,11]]}
[]
[null,"CÓDIGO","DEPENDENCIA","CONCATENADO",null,"SUJETOS DE CONTROL FISCAL","REGIMEN","DEPENDENCIA","INGRESOS",null,null,"CONCEPTO","Rango de Calificación",null,null,"CLASIFICACION PRESUPUESTAL",null,"Sujeto de Control","TIPO DE MATRIZ\n(Identificación de la matriz a aplicar)","TIPO_ENTIDAD","Columna1","Columna2","MACROPROCESO","PUBLICA","MIXTA>50","MIXTA<50","CORPORACION"]
[null,100000,"DIRECCIÓN SECTOR SALUD ","100000 - DIRECCIÓN SECTOR SALUD ",null,"1 - Fondo de Desarrollo Local de Usaquén","FDL","12101 - GERENCIA LOCAL USAQUÉN","SI",null,null,null,">=","<",null,"INGRESOS","ya","1 - Fondo de Desarrollo Local de Usaquén","PUBLICA SIN GESTIÓN FINANCIERA","PUBLICA con ing","CON INGRESOS","x","GESTIÓN FINANCIERA",0.35,0.45,0.6,0.6]
[null,110000,"DIRECCIÓN SECTOR GOBIERNO ","110000 - DIRECCIÓN SECTOR GOBIERNO ",null,"10 - Fondo de Desarrollo Local de Engativá","FDL","12110 - GERENCIA LOCAL ENGATIVÁ ","SI",null,null,"EFICAZ",0.75,1,null,"GASTOS",null,"10 - Fondo de Desarrollo Local de Engativá","PUBLICA SIN GESTIÓN FINANCIERA","PUBLICA con ing","CON INGRESOS",null,"GESTIÓN PRESUPUESTAL",0.25,0.15,"NO APLICA","NO APLICA"]
[null,12000,"DIRECCIÓN DE PARTICIPACIÓN CIUDADANA Y DESARROLLO LOCAL ","12000 - DIRECCIÓN DE PARTICIPACIÓN CIUDADANA Y DESARROLLO LOCAL ",null,"100 - Concejo de Bogotá D.C.","No tiene","110000 - DIRECCIÓN SECTOR GOBIERNO ","NO",null,null,"CON OBSERVACIONES",0.65,0.75,null,"GASTOS DE OPERACIÓN COMERCIAL",null,"100 - Concejo de Bogotá D.C.","PUBLICA SIN GESTIÓN FINANCIERA Y SIN CONTRATACION","CONCEJO","SIN INGRESOS",null,"Y RESULTADOS",0.4,0.4,0.4,0.4]
[null,120000,"DIRECCIÓN SECTOR EQUIDAD Y GÉNERO ","120000 - DIRECCIÓN SECTOR EQUIDAD Y GÉNERO ",null,"102 - Personería de Bogotá","100% publica","110000 - DIRECCIÓN SECTOR GOBIERNO ","NO",null,null,"INEFICAZ",0,0.65,null,"RESERVAS CONSTITUIDAS / OBLIGACIONES / CUENTAS POR PAGAR","ya","102 - Personería de Bogotá","PUBLICA SIN GESTIÓN FINANCIERA","PUBLICA sin ing","SIN INGRESOS"]
[null,12101,"GERENCIA LOCAL USAQUÉN","12101 - GERENCIA LOCAL USAQUÉN",null,"104 - Secretaría General de la Alcaldía Mayor de Bogotá, D.C. – SGAMB","100% publica","110000 - DIRECCIÓN SECTOR GOBIERNO ","NO",null,null,"ABSTENCIÓN","El Auditor no conto con información o tiene incertidumbre relevante de la información reflejada en los informes presupuestales",null,null,"PASIVOS EXIGIBLES",null,"104 - Secretaría General de la Alcaldía Mayor de Bogotá, D.C. – SGAMB","PUBLICA SIN GESTIÓN FINANCIERA","PUBLICA sin ing","SIN INGRESOS",null,"PROCESO","PUBLICA con ing","PUBLICA sin ing","PUBLICA","MIXTA>50 sin Ing","MIXTA>50","MIXTA<50","CORPORACION","CONCEJO",null,"OPINIONES","CONCEPTOS INVERSIÓN Y GASTO"]
[null,12102,"GERENCIA LOCAL CHAPINERO ","12102 - GERENCIA LOCAL CHAPINERO ",null,"105 - Veeduría Distrital","100% publica","110000 - DIRECCIÓN SECTOR GOBIERNO ","SI",null,null,null,null,null,null,"VIGENCIAS FUTURAS",null,"105 - Veeduría Distrital","PUBLICA SIN GESTIÓN FINANCIERA","PUBLICA sin ing","SIN INGRESOS",null,"ESTADOS FINANCIEROS",1,1,0.6,0.4,0.4,0.4,1,1,null,"Limpia o Sin Salvedades","EFECTIVO"]
[null,12103,"GERENCIA LOCAL SANTAFÉ","12103 - GERENCIA LOCAL SANTAFÉ",null,"11 - Fondo de Desarrollo Local de Suba","FDL","12111 - GERENCIA LOCAL SUBA ","SI",null,null,null,null,null,null,null,null,"11 - Fondo de Desarrollo Local de Suba","PUBLICA SIN GESTIÓN FINANCIERA","PUBLICA con ing","CON INGRESOS",null,"DESEMPEÑO FINANCIERO","NO APLICA","NO APLICA",0.4,0.6,0.6,0.6,"NO APLICA","NO APLICA",null,"Con Salvedades","MODERADAMENTE EFECTIVO"]
[null,12104,"GERENCIA LOCAL SAN CRISTÓBAL ","12104 - GERENCIA LOCAL SAN CRISTÓBAL ",null,"110 - Secretaría Distrital de Gobierno – SDG","100% publica","110000 - DIRECCIÓN SECTOR GOBIERNO ","NO",null,null,null,null,null,null,null,null,"110 - Secretaría Distrital de Gobierno – SDG","PUBLICA SIN GESTIÓN FINANCIERA","PUBLICA sin ing","SIN INGRESOS",null,"EJECUCIÓN DE INGRESOS",0.4,"NO APLICA",0.4,"NO APLICA",0.6,"NO APLICA","NO APLICA","NO APLICA",null,"Negativa","INEFECTIVO"]
[null,12105,"GERENCIA LOCAL USME ","12105 - GERENCIA LOCAL USME ",null,"111 - Secretaría Distrital de Hacienda – SDH","100% publica","150000 - DIRECCIÓN SECTOR HACIENDA ","SI",null,null,null,null,null,null,null,"311 - Terminal de Transporte S.A.  ","111 - Secretaría Distrital de Hacienda – SDH","PUBLICA CON GESTIÓN FINANCIERA","PUBLICA","CON INGRESOS",null,"EJECUCIÓN DE GASTOS o COSTOS Y GASTOS",0.6,1,0.6,1,0.4,"NO APLICA",1,1,null,"Abstención"]
[null,12106,"GERENCIA LOCAL TUNJUELLTO ","12106 - GERENCIA LOCAL TUNJUELLTO ",null,"112 - Secretaría de Educación del Distrito – SED - Fondos de Servicios Educativos de los Colegios e Instituciones adscritas a la Secretaría de Educación del Distrito","100% publica","140000 - DIRECCIÓN SECTOR EDUCACIÓN ","NO",null,null,null,null,null,null,null,null,"112 - Secretaría de Educación del Distrito – SED - Fondos de Servicios Educativos de los Colegios e Instituciones adscritas a la Secretaría de Educación del Distrito","PUBLICA SIN GESTIÓN FINANCIERA","PUBLICA","CON INGRESOS",null,"PLANEACIÓN Y RESULTADOS",0.4,0.4,0.4,0.3,0.3,0.3,0.3,"NO APLICA",null,"NO APLICA"]
[null,12107,"GERENCIA LOCAL BOSA ","12107 - GERENCIA LOCAL BOSA ",null,"113 - Secretaría Distrital de Movilidad – SDM","100% publica","80000 - DIRECCIÓN SECTOR MOVILIDAD ","SI",null,null,null,null,null,null,null,null,"113 - Secretaría Distrital de Movilidad – SDM","PUBLICA SIN GESTIÓN FINANCIERA","PUBLICA","CON INGRESOS",null,"PLANEACIÓN Y RESULTADOS",0.4,0.4,0.4,0.3,0.3,0.3,0.3,"NO APLICA"]
[null,12108,"GERENCIA LOCAL KENNEDY ","12108 - GERENCIA LOCAL KENNEDY ",null,"114 - Secretaría Distrital de Salud – SDS","100% publica","100000 - DIRECCIÓN SECTOR SALUD ","NO",null,null,null,null,null,null,null,null,"114 - Secretaría Distrital de Salud – SDS","PUBLICA SIN GESTIÓN FINANCIERA","PUBLICA","CON INGRESOS",null,"PLANEACIÓN Y RESULTADOS",0.4,0.4,0.4,0.3,0.3,0.3,0.3,"NO APLICA"]
[null,12109,"GERENCIA LOCAL FONTIBÓN ","12109 - GERENCIA LOCAL FONTIBÓN ",null,"117 - Secretaría Distrital de Desarrollo Económico – SDDE","100% publica","190000 - DIRECCIÓN SECTOR DESARROLLO ECONÓMICO, INDUSTRIA Y TURISMO ","NO",null,null,null,null,null,null,null,null,"117 - Secretaría Distrital de Desarrollo Económico – SDDE","PUBLICA SIN GESTIÓN FINANCIERA","PUBLICA","CON INGRESOS",null,"GESTIÓN CONTRACTUAL",0.6,0.6,0.6,0.7,0.7,0.7,0.7,"NO APLICA"]
[null,12110,"GERENCIA LOCAL ENGATIVÁ ","12110 - GERENCIA LOCAL ENGATIVÁ ",null,"118 - Secretaría Distrital del Hábitat - SDHT","100% publica","130000 - DIRECCIÓN SECTOR HÁBITAT Y AMBIENTE ","NO",null,null,null,null,null,null,null,null,"118 - Secretaría Distrital del Hábitat - SDHT","PUBLICA SIN GESTIÓN FINANCIERA","PUBLICA","CON INGRESOS"]
[null,12111,"GERENCIA LOCAL SUBA ","12111 - GERENCIA LOCAL SUBA ",null,"119 - Secretaría Distrital de Cultura, Recreación y Deporte – SDCRD","100% publica","220000 - DIRECCIÓN SECTOR CULTURA, RECREACIÓN Y DEPORTE ","SI",null,null,null,null,null,null,null,null,"119 - Secretaría Distrital de Cultura, Recreación y Deporte – SDCRD","PUBLICA CON GESTIÓN FINANCIERA","PUBLICA","CON INGRESOS"]
[null,12112,"GERENCIA LOCAL BARRIOS UNIDOS ","12112 - GERENCIA LOCAL BARRIOS UNIDOS ",null,"12 - Fondo de Desarrollo Local de Barrios Unidos","FDL","12112 - GERENCIA LOCAL BARRIOS UNIDOS ","SI",null,null,null,null,null,null,null,{"$f":"VLOOKUP($Q$11,TablaSujetos2[],3,TRUE)","v":"MIXTA>50 sin ing"},"12 - Fondo de Desarrollo Local de Barrios Unidos","PUBLICA SIN GESTIÓN FINANCIERA","PUBLICA con ing","CON INGRESOS"]
[null,12113,"GERENCIA LOCAL TEUSAQUILLO ","12113 - GERENCIA LOCAL TEUSAQUILLO ",null,"120 - Secretaría Distrital de Planeación – SDP","100% publica","130000 - DIRECCIÓN SECTOR HÁBITAT Y AMBIENTE ","NO",null,null,null,null,null,null,null,null,"120 - Secretaría Distrital de Planeación – SDP","PUBLICA SIN GESTIÓN FINANCIERA","PUBLICA con ing","CON INGRESOS"]
[null,12114,"GERENCIA LOCAL MÁRTIRES ","12114 - GERENCIA LOCAL MÁRTIRES ",null,"121 - Secretaría Distrital de la Mujer – SDM","100% publica","120000 - DIRECCIÓN SECTOR EQUIDAD Y GÉNERO ","NO",null,null,null,null,null,null,null,null,"121 - Secretaría Distrital de la Mujer – SDM","PUBLICA SIN GESTIÓN FINANCIERA","PUBLICA sin ing","SIN INGRESOS"]
{"$rows_left_out":84}
{"sheet":"INSTRUCTIVO","index":1,"n_rows":32,"n_cols":6,"rows_kept":32,"cut":false,"hidden":false,"merged":[[11,1,11,5],[0,2,0,4],[1,1,1,5],[2,1,2,5],[3,1,3,5],[4,1,4,5],[5,1,5,5],[6,1,6,5],[7,1,7,5],[8,1,8,5],[9,1,9,5],[10,1,10,5],[25,1,25,5],[12,1,12,5],[13,1,13,5],[14,1,14,5],[15,1,15,5],[16,1,16,5],[17,1,17,5],[20,1,20,5],[21,1,21,5],[22,1,22,5],[23,1,23,5],[24,1,24,5],[18,1,18,5],[19,1,19,5],[31,1,31,5],[26,1,26,5],[29,1,29,5],[30,1,30,5],[27,1,28,5]]}
[null,null,"MATERIALIDAD Y CONCEPTO AUDITORÍA DE CUMPLIMIENTO \n\nInstructivo",null,null,"Código formato: PVCGF-16-03\n\nVersión: 3.0"]
[]
[null,"El PVCGF 16-03 está compuesto por dos Hojas: \n   \n  "]
[null,"1. Materialidad AC"]
[null,"2. Concepto AC (Click para ir a Instructivo)"]
[null,"INSTRUCTIVO MATERIALIDAD AC"]
[null,"Datos Generales de la Auditoría"]
[null,"Determinación del tipo Materialidad\nLista Desplegable. El equipo auditor determina con base en el conocimiento del asunto el (los) tipo(s) de materialidad que aplicaran.\n\nEl auditor podrá seleccionar la  materialidad cualitiva por ejemplo, cuando no existan datos exactos o precisos sobre los recursos a auditar, cuando el asunto a auditar por su complejidad no sea facilmente identificable el valor de los recursos a auditar, cuando se conozca el valor del universo del asunto a auditar,  pero en fase de planeación no se cuenta con información certera sobre los valores financiados con recursos de otros entes territoriales o incluso de la nación o cuando el asunto auditor es tan particular que requiere una evaluación específica, por tanto el concepto queda a jucio profesional del auditor.\n\n\n\n\n"]
[null,"1. MATERIALILDAD CUANTITATIVA\n1.1. Definición de la base y monto del asunto por auditar.\n\n\n\n\n\n"]
[null,"Base seleccionada\nLista Desplegable. El auditor podrá elegir entre las bases relacionadas a continuación:\n- Ingresos programados\n- Gastos programados\n- Ingresos ejecutados\n- Gastos ejecutados\n- Registro o cuenta de los Estados Financieros o del Presupuesto\n- Recursos Asignados al Plan Acción de Inversiones\n- Valor Plan de Acción Politica Pública\n- Valor del Plan Estratégico o el que haga sus veces\n- Pago de Sentencias Judiciales, Laudos Arbitrales y Conciliaciones Extrajudiciales y similares\n- Otros conceptos\nEn caso de elegir \"Otros conceptos\", en el siguiente campo, especifíquelo(s)\nMonto\nCorresponde a la cuantía relacionada al asunto por auditar"]
[null,"1.2. Criterios para determinar el Riesgo del Asunto\n\nEl asunto predominante es el tema que tiene mayor impacto dentro del asunto a auditar en el caso que existan varios temas o asuntos a auditar.\n\nLa Valoración del Riesgo Combinado del Asunto a Auditar, se extrae de la matriz de riesgos y controles en fase de planeación en la auditoría que se está desarrollando.\n\n\n\n\n\n\n\n\n\n\n"]
[null,"Los criterios o variables para determinar el nivel de riesgo son los siguientes:\n 1. Hallazgos configurados en la auditoría anterior en el Proceso (predominante) asociado al asunto\n 2. Concepto u Opinión del Proceso (predominante) asociado al asunto, de la auditoría anterior (Financiera de Gestión y Resultados)\n 3. Calificación del Control Fiscal Interno de la auditoría anterior del Proceso (predominante) asociado al asunto\n 4. Valoración del Riesgo Residual o Combinado del asunto por auditar.\nEn cada una de las variables se escoge el valor correspondiente de la lista desplegable.\nEn el caso que se hayan dos o mas procesos asociados al asunto por auditar, la información de los hallazgos, concepto u opinión y calificación de control fiscal Interno de la auditoría anterior, se tomará del proceso predominante en el asunto. \n"]
[null,"Las opciones y los puntajes para cada criterio son los siguientes: "]
[null,"1.3. Determinación del Riesgo del Asunto\nLa sumatoria de los puntajes obtenidos determina automáticamente el nivel de riesgo de control fiscal del asunto por auditar, así:\n"]
[null,"1.4. Determinación del Porcentaje de Materialidad  de Planeación (MP)\nPara cada nivel de riesgo, existe asociado un rango de porcentajes de materialidad, como se ilustra: \n\n\n\n\n\n\n"]
[null,"Una vez determinado el rango de porcentajes de materialidad de planeación, el equipo auditor con su juicio profesional,  establece el porcentaje de materialidad cuantitativa:\n \n\n\nEl porcentaje determinado se multiplica con la base seleccionada estableciendo el valor de Materialidad de Planeación (MP)\n\n\n\n\n\n"]
[null,"1.5 Error Tolerable de incumplimiento (ET): Es la tasa máxima de incumplimiento que los auditores están dispuestos a aceptar del universo del asunto. Es el límite más allá del cual, de ser excedido por la tasa real de incumplimiento, afectará el concepto del auditor sobre el asunto auditado.\nCampo automático. Corresponde al 50% de la MP cuando el nivel de riesgo determinado es Alto; y al 75%  cuando el riesgo es Bajo o Medio\n\n\n"]
[null,"1.6. Cálculo del umbral para Resumen de Diferencias (RD): Es  un valor por debajo del cual no se acumularían las incorrecciones puesto que se espera que la acumulación de tales valores claramente no tenga un efecto material sobre el asunto auditado. De todas formas, si bien estas diferencias no son materiales para el tema del concepto, no significan que no sean hallazgos que deben reportarse dentro del informe de la auditoría. Es potestad del equipo auditor utilizar este método cuando se usa la materialidad cuantitativa.\nCampo automático. El RD corresponde al 3% de la MP cuando el riesgo determinado es alto y 5% para los demás casos.\n\n\n\n\n\nLa aplicación del resumen de diferencias se da a criterio del auditor, por esa razón es que en la hoja de concepto de la materialidad cuantitativa existe la opción de marcar si o no.  Es decir, es potestad del equipo auditor utilizar este método cuando se usa la materialidad cuantitativa.\n\nEl resumen de diferencias se calcula así: (RD): Es un valor por debajo del cual no se acumularían las incorrecciones puesto que se espera que la acumulación de tales valores claramente no tenga un efecto material sobre el asunto auditado. De todas formas, si bien estas diferencias no son materiales para el tema del concepto, no significan que no sean hallazgos que deben reportarse dentro del informe de la auditoría, simplemente que los hallazgos que estén por debajo del RD no serán tenidos en cuenta en la sumatoria del total de incumplimientos cuantitativos.\n\nEl RD corresponde al 3% de la materialidad planeada cuando el riesgo determinado es alto y 5% de la materialidad planeada cuando el riesgo de auditoría es medio o bajo."]
[null,"Ejemplo 1  Concepto con materialidad cuantitativa sin aplicar resumen de diferencias.\n\n\n\n\n\n\n\n\n\n\n\n\n\n\n"]
[null,"Ejemplo 2 Concepto con materialidad cuantitativa aplicando resumen de diferencias.\n\nEn el ejemplo se observa que el concepto cambio de \"Seguridad Razonable - Incumplimiento Material con Reservas\" a un concepto de \"Seguridad Razonable - Sin Reservas\" al aplicar el resumen de diferencias, dado que la sumatoria del total de incumplimientos cuantitativos no tomó el hallazgo fiscal menor o igual al valor de resumen de diferencias por valor de 70.000.000.\n\nEsta opción le permite al auditor descartar u obviar los hallazgos fiscales que no sean tan trascendentes para emitir el concepto de cumplimiento, lo que se traduce en un beneficio para la calificación de la gestión fiscal de sujeto de vigilancia y control fiscal en la auditoría de cumplimiento.  Se reitera que esto no es óbice para que los hallazgos así sean considerados pequeños o menores no se presenten dentro del informe de auditoría."]
{"$rows_left_out":13}
{"sheet":"1. Materialidad AC","index":2,"n_rows":184,"n_cols":10,"rows_kept":184,"cut":false,"hidden":false,"merged":[[6,2,6,5],[0,2,0,4],[2,2,2,5],[3,2,3,5],[4,2,4,5],[5,2,5,5],[25,3,25,4],[7,2,7,5],[8,2,8,5],[9,2,9,5],[10,2,10,5],[11,2,11,3],[12,1,12,5],[13,1,13,5],[14,1,14,2],[17,1,17,2],[19,1,19,4],[20,1,20,3],[52,1,52,4],[26,1,27,1],[26,2,27,2],[26,3,27,4],[28,1,28,4],[29,1,29,4],[32,1,32,4],[33,1,33,4],[39,1,44,4],[45,1,45,4],[46,1,46,4],[47,1,47,4],[53,1,53,4],[55,1,55,4],[56,1,56,4],[60,1,60,5],[61,1,62,2],[61,3,61,5],[62,3,62,4],[63,1,63,2],[63,3,63,4],[64,1,64,2],[64,3,64,4],[65,1,65,2],[65,3,65,4],[72,1,72,2],[72,3,72,4],[73,1,73,2],[73,3,73,4],[74,1,74,2],[74,3,74,4],[110,2,113,2],[110,3,113,3],[110,4,113,4],[110,5,122,5],[110,6,113,6],[114,2,117,2],[114,3,117,3],[114,4,117,4],[114,6,117,6],[118,2,122,2],[118,3,122,3],[118,4,122,4],[118,6,122,6],[75,1,75,2],[75,3,75,4],[79,1,79,5],[81,1,86,4],[109,1,109,6],[80,1,80,4],[76,1,76,2],[76,3,76,4],[77,1,77,2],[77,3,77,4],[78,1,78,2],[78,3,78,4],[71,1,71,2],[66,3,66,4],[67,3,67,4],[68,3,68,4],[69,3,69,4],[70,3,70,4],[71,3,71,4],[66,1,66,2],[67,1,67,2],[68,1,68,2],[69,1,69,2],[70,1,70,2]]}
[null,null,"MATERIALIDAD AUDITORÍA DE CUMPLIMIENTO",null,null,"Código formato: PVCGF-16-03\n\nVersión: 3.0"]
[]
[null,"Dirección de Fiscalización:",{"$f":"_xlfn.IFNA(VLOOKUP(C4,LISTAS!F3:H100,3,),\"\")","v":"150000 - DIRECCIÓN SECTOR HACIENDA "}]
[null,"Sujeto de vigilancia y control fiscal:","111 - Secretaría Distrital de Hacienda – SDH"]
[null,"Asunto a auditar:","“Evaluar el cumplimiento de la gestión en la fiscalización, liquidación y recobro del Impuesto \nPredial Unificado-IPU vigencia 2017 y 2018”"]
[null,"Vigencia PDVCF:",2025]
[null,"Código Auditoría:",69]
[null,"Periodo Auditado","2017-2018"]
[null,"Fecha de elaboración:",45757]
[null,"Proceso(s) vinculado(s) (Alcance):","Presupuesto de Ingresos"]
[]
[null,"Materialidad Aplicada","Cuantitativa y Cualitativa (Combinada)"]
[]
[null,"MATERIALIDAD CUANTITATIVA"]
[null,"I. Seleccione una de las bases:"]
[null,"Base seleccionada","Monto"]
[null,"Otros conceptos",5000000]
[null,"Otros conceptos (Identifique): "]
[]
[null,"CRITERIOS PARA DETERMINAR EL RIESGO DEL ASUNTO"]
{"$rows_left_out":165}
{"sheet":"2. Conceptos AC","index":3,"n_rows":284,"n_cols":20,"rows_kept":284,"cut":false,"hidden":false,"merged":[[42,5,42,7],[42,1,42,4],[0,2,0,5],[2,2,2,5],[3,2,3,5],[4,2,4,5],[5,2,5,5],[6,2,6,5],[7,2,7,5],[8,2,8,5],[9,2,9,5],[11,1,11,6],[33,17,33,19],[35,15,39,15],[37,3,40,4],[37,5,40,6],[41,1,41,6],[33,15,34,16],[34,1,34,6],[35,3,36,4],[35,5,36,6],[54,12,54,16],[59,6,60,6],[59,7,60,7],[188,5,189,5],[63,1,63,5],[64,2,64,5],[65,2,65,5]]}
[null,null,"CONCEPTO AUDITORÍA DE CUMPLIMIENTO",null,null,null,"Código formato: PVCGF-16-03\n\nVersión: 3.0"]
[]
[null,"Dirección de Fiscalización:",{"$f":"+'1. Materialidad AC'!C3:F3","v":"150000 - DIRECCIÓN SECTOR HACIENDA "}]
[null,"Sujeto de vigilancia y control fiscal:",{"$f":"+'1. Materialidad AC'!C4:F4","v":"111 - Secretaría Distrital de Hacienda – SDH"}]
[null,"Asunto a auditar:",{"$f":"+'1. Materialidad AC'!C5:F5","v":"“Evaluar el cumplimiento de la gestión en la fiscalización, liquidación y recobro del Impuesto \nPredial Unificado-IPU vigencia 2017 y 2018”"}]
[null,"Vigencia PDVCF:",{"$f":"+'1. Materialidad AC'!C6:F6","v":2025}]
[null,"Código Auditoría:",{"$f":"+'1. Materialidad AC'!C7:F7","v":69}]
[null,"Periodo Auditado",{"$f":"+'1. Materialidad AC'!C8:F8","v":"2017-2018"}]
[null,"Fecha de elaboración:",{"$f":"+'1. Materialidad AC'!C9:F9","v":45757}]
[null,"Proceso(s) vinculado(s) (Alcance):",{"$f":"+'1. Materialidad AC'!C10:F10","v":"Presupuesto de Ingresos"}]
[]
[null,"HALLAZGOS - INCUMPLIMIENTOS Y/O DESVIACIONES CUANTITATIVAS"]
[null,"No. Hallazgo","Proceso(s) asociado al Asunto","Fuente(s) de Criterio","Criterio(s) incumplido","Incidencia del Hallazgo","Estimación cuantitativa del Hallazgo"]
[]
[]
[]
[]
[]
[]
[]
{"$rows_left_out":264}